Build #109

Build: #109 failed Changes by Jesse White

Build result summary

Details

Completed
Duration
719 minutes
Labels
None
Revisions
OpenNMS (develop branch)
cf8b6c01643dd81f4ae8827c6e932cb350f9c65e cf8b6c01643dd81f4ae8827c6e932cb350f9c65e
OpenNMS Installer
da12784d9ab4ba4aacedec0283d0c04075fd6ebf da12784d9ab4ba4aacedec0283d0c04075fd6ebf
OpenNMS-Repo
088d710674109759251f42c6720d74ea80cf3f13 088d710674109759251f42c6720d74ea80cf3f13
Smoke Tests
cb1e72265cf2ce10cb4872f58120272b340a1ce1 cb1e72265cf2ce10cb4872f58120272b340a1ce1
OpenNMS Bamboo Utils
0a62053bc90f6ffcce1e17256674b2dae7b4f8a3 0a62053bc90f6ffcce1e17256674b2dae7b4f8a3
OpenNMS System Test API
2f3a985377db43ce9b451390b9744bac402ffbd7 2f3a985377db43ce9b451390b9744bac402ffbd7
Total tests
2373
Failing since
#27 (Changes by mvrueden <mvrueden@users.noreply.github.com> and Jesse White)

Responsible

Code commits

OpenNMS (develop branch)
Author Commit Message Commit date
Jesse White Jesse White cf8b6c01643dd81f4ae8827c6e932cb350f9c65e cf8b6c01643dd81f4ae8827c6e932cb350f9c65e Merge remote-tracking branch 'origin/release-24.0.0' into develop
Jesse White Jesse White 76371e80f8d141d8903edc8743c63e75ed4174da m 76371e80f8d141d8903edc8743c63e75ed4174da Fix Mapstruct artifact - need to use different one for new version.
Jesse White Jesse White 3651c1ab7480b351c96d639e2cb04a053d85ac45 m 3651c1ab7480b351c96d639e2cb04a053d85ac45 Merge remote-tracking branch 'origin/foundation-2018' into release-24.0.0
mvrueden <mvrueden@users.noreply.github.com> mvrueden <mvrueden@users.noreply.github.com> c51bddef095a0ad23e31be13c241dc9d862950b7 m c51bddef095a0ad23e31be13c241dc9d862950b7 NMS-10539: Upgrade Karaf to 4.2.3 (#2380)
* NMS-10539: initial update to Karaf 4.2.2

* NMS-10539: Update pax web version as well as its dependencies

* NMS-10539: Expose (bridge) listener correctly

* NMS-10539: Use Apache Felix HTTP Bridge instead of forking it

* NMS-10539: Use osgi.http.whiteboard.servlet.pattern instead of alias property when registering javax.servlet.Servlets

* TODO MVR: Fix preserveOnRefresh vaadin issue

* NMS-10539: Use latest felix version

* NMS-10539: Rework request dispatching/filtering

* NMS-10539: Rework Vaadin UI creation via OSGi

* NMS-10539: Teporarily disable plugin manager

* NMS-10539: Delete existing custom bridge code and move proxy code to its own module

* NMS-10539: Prepare ProxyFilter to be more generic and handle rest endpoints

* NMS-10539: Make ReST endpoints genericly exposable

* NMS-10539: Rework container/bridge dependencies

* NMS-10539: Cleanup

* NMS-10539: First approach to fix FeatureInstallKarafIT

* NMS-10539: Temporarily disable test

* NMS-10539: Use servlet.init.widgetset in favour of init.widgetset

* NMS-10539: Integrate updated (snaphost) version of pluginmanager

* NMS-105439: Remove duplicated diagnostic resource

* NMS-10539: Also listen for resources

* NMS-10539: Remove unneded files

* NMS-10539: Enable pluginmanager again

* NMS-10539: Remove more no longer needed files

* NMS-10539: Fix isValid()

* NMS-10539: Change web.xml name/description

* NMS-10539: Remove servlet exposure (it is now done in the plugin manager project)

* NMS-10539: Fix minion/sentinel startup properties to match karaf 4.2.2 versions

* NMS-10539: Migrate to Apache Karaf 4.2.3

* NMS-10539: Hack login module for now

* NMS-10539: Try to fix tests

* NMS-10539: Install aries-blueprint just to be sure

* NMS-10539: Fix user properties for sentinel/minion

* NMS-10539: Use karaf 4.3.2. default log layout for sentinel/minion

* NMS-15039: Use non-snapshot versions

* NMS-10539: Disable opennms-api-layer for now

* NMS-10539: Update plugin configuration

* NMS-10539: Remove repositories

* Revert "NMS-10539: Disable opennms-api-layer for now"

This reverts commit 02fd9beb8f355c7e86238d9a09ae5b90b5aa3b8c.

* NMS-10539: Fix config:edit for managed service factories

* NMS-10539: Update breaking changes

* NMS-10539: Remove outdated TODO

* NMS-10539: Rework LoginModule

* NMS-10539: Make comment more clear

* NMS-10539: Don't worry about duplicated code at this point

* NMS-10539: Add comment

* NMS-10539: Ignore all KarafTestCase tests for now

* NMS-10539: Add missing feature repository and remove duplicate feature

* NMS-10539: Add missing javax.xml.bind package to custom.properties

* Remove librairies for lib folder.
Jesse White Jesse White 65ed5ec4aa2658e4ea669f422cc00f4b0f4e0a18 m 65ed5ec4aa2658e4ea669f422cc00f4b0f4e0a18 Merge pull request #2373 from OpenNMS/features/controller-api
OIA-6: OIA-7: Many improvements to help support controller integrations

Tests

New test failures 5
Status Test View job Duration
Collapse Failed HeartbeatSinkBlueprintIT org.opennms.core.ipc.sink.camel.itests.HeartbeatSinkBlueprintIT History
Integration Test (Flapping) 2 secs
java.lang.Exception: ActiveMQ broker was not started or stopped unexpectedly. Error: org.apache.activemq.broker.BrokerStoppedException: Stop invoked
	at org.opennms.core.test.activemq.ActiveMQBroker.before(ActiveMQBroker.java:56)
	at org.junit.rules.ExternalResource$1.evaluate(ExternalResource.java:46)
	at org.junit.rules.RunRules.evaluate(RunRules.java:20)
	at org.junit.runners.ParentRunner.run(ParentRunner.java:363)
	at org.springframework.test.context.junit4.SpringJUnit4ClassRunner.run(SpringJUnit4ClassRunner.java:193)
	at org.apache.maven.surefire.junit4.JUnit4Provider.execute(JUnit4Provider.java:275)
	at org.apache.maven.surefire.junit4.JUnit4Provider.executeWithRerun(JUnit4Provider.java:183)
(5 more lines...)
Collapse Failed HeartbeatSinkBlueprintIT canConsumeMessagesInParallel History
Integration Test (Flapping) 2 secs
java.lang.NullPointerException: null
	at org.opennms.core.ipc.sink.camel.itests.HeartbeatSinkBlueprintIT.canConsumeMessagesInParallel(HeartbeatSinkBlueprintIT.java:171)
Collapse Failed SyslogKafkaElasticsearch5IT testMinionSyslogsOverKafkaToEsRest History
Smoke Test (Flapping) 7 mins
com.jayway.awaitility.core.ConditionTimeoutException: Condition with lambda expression in org.opennms.test.system.api.NewTestEnvironment was not fulfilled within 5 minutes.
Collapse Failed SFlowTelemetryAdapterIT verifyAdapter History
Smoke Test (Flapping) 6 mins
com.jayway.awaitility.core.ConditionTimeoutException: org.opennms.test.system.api.NewTestEnvironment.waitForOpenNMS Callable expected not null but was <null> within 5 minutes.
Collapse Failed TopologyIT verifyNoVerticesFoundTextIsShown History
Smoke Test (Flapping) 36 secs
org.openqa.selenium.NoSuchElementException: Unable to locate element: {"method":"xpath","selector":"//*/table[@class='search-token-field']//div[@class='search-token-label' and contains(text(),'Node-3')]"}
Command duration or timeout: 1.09 seconds
For documentation on this error, please visit: http://seleniumhq.org/exceptions/no_such_element.html
Build info: version: '2.53.1', revision: 'a36b8b1cd5757287168e54b817830adce9b0158d', time: '2016-06-30 19:26:09'
System info: host: 'cmu.internal.opennms.com', ip: '172.20.1.203', os.name: 'Linux', os.arch: 'amd64', os.version: '4.18.0-16-generic', java.version: '1.8.0_201'
Driver info: org.openqa.selenium.firefox.FirefoxDriver
Capabilities [{applicationCacheEnabled=true, rotatable=false, handlesAlerts=true, databaseEnabled=true, version=45.0.2, platform=LINUX, nativeEvents=false, acceptSslCerts=true, webStorageEnabled=true, locationContextEnabled=true, browserName=firefox, takesScreenshot=true, javascriptEnabled=true, cssSelectorsEnabled=true}]
Session ID: 06bffff3-60b4-4e5d-a68b-a24d8dcfa304
(18 more lines...)
Existing test failures 20
Status Test Failing since View job Duration
java.lang.IllegalStateException: Failed to load ApplicationContext
Caused by: java.lang.IllegalArgumentException: Cannot load an ApplicationContext with a NULL 'contextLoader'. Consider annotating your test class with @ContextConfiguration or @ContextHierarchy.
java.lang.IllegalStateException: Failed to load ApplicationContext
Caused by: java.lang.IllegalArgumentException: Cannot load an ApplicationContext with a NULL 'contextLoader'. Consider annotating your test class with @ContextConfiguration or @ContextHierarchy.
java.lang.IllegalStateException: Failed to load ApplicationContext
Caused by: java.lang.IllegalArgumentException: Cannot load an ApplicationContext with a NULL 'contextLoader'. Consider annotating your test class with @ContextConfiguration or @ContextHierarchy.
java.lang.IllegalStateException: Failed to load ApplicationContext
Caused by: java.lang.IllegalArgumentException: Cannot load an ApplicationContext with a NULL 'contextLoader'. Consider annotating your test class with @ContextConfiguration or @ContextHierarchy.
java.lang.IllegalStateException: Failed to load ApplicationContext
Caused by: java.lang.IllegalArgumentException: Cannot load an ApplicationContext with a NULL 'contextLoader'. Consider annotating your test class with @ContextConfiguration or @ContextHierarchy.
java.lang.IllegalStateException: Failed to load ApplicationContext
Caused by: java.lang.IllegalArgumentException: Cannot load an ApplicationContext with a NULL 'contextLoader'. Consider annotating your test class with @ContextConfiguration or @ContextHierarchy.
java.lang.IllegalStateException: Failed to load ApplicationContext
Caused by: java.lang.IllegalArgumentException: Cannot load an ApplicationContext with a NULL 'contextLoader'. Consider annotating your test class with @ContextConfiguration or @ContextHierarchy.
java.lang.IllegalStateException: Failed to load ApplicationContext
Caused by: java.lang.IllegalArgumentException: Cannot load an ApplicationContext with a NULL 'contextLoader'. Consider annotating your test class with @ContextConfiguration or @ContextHierarchy.
java.lang.IllegalStateException: Failed to load ApplicationContext
Caused by: java.lang.IllegalArgumentException: Cannot load an ApplicationContext with a NULL 'contextLoader'. Consider annotating your test class with @ContextConfiguration or @ContextHierarchy.
java.lang.IllegalStateException: Failed to load ApplicationContext
Caused by: java.lang.IllegalArgumentException: Cannot load an ApplicationContext with a NULL 'contextLoader'. Consider annotating your test class with @ContextConfiguration or @ContextHierarchy.
java.lang.IllegalStateException: Failed to load ApplicationContext
Caused by: java.lang.IllegalArgumentException: Cannot load an ApplicationContext with a NULL 'contextLoader'. Consider annotating your test class with @ContextConfiguration or @ContextHierarchy.
java.lang.IllegalStateException: Failed to load ApplicationContext
Caused by: java.lang.IllegalArgumentException: Cannot load an ApplicationContext with a NULL 'contextLoader'. Consider annotating your test class with @ContextConfiguration or @ContextHierarchy.
java.lang.IllegalStateException: Failed to load ApplicationContext
Caused by: java.lang.IllegalArgumentException: Cannot load an ApplicationContext with a NULL 'contextLoader'. Consider annotating your test class with @ContextConfiguration or @ContextHierarchy.
java.lang.IllegalStateException: Failed to load ApplicationContext
Caused by: java.lang.IllegalArgumentException: Cannot load an ApplicationContext with a NULL 'contextLoader'. Consider annotating your test class with @ContextConfiguration or @ContextHierarchy.
java.lang.IllegalStateException: Failed to load ApplicationContext
Caused by: java.lang.IllegalArgumentException: Cannot load an ApplicationContext with a NULL 'contextLoader'. Consider annotating your test class with @ContextConfiguration or @ContextHierarchy.
java.lang.IllegalStateException: Failed to load ApplicationContext
Caused by: java.lang.IllegalArgumentException: Cannot load an ApplicationContext with a NULL 'contextLoader'. Consider annotating your test class with @ContextConfiguration or @ContextHierarchy.
java.lang.IllegalStateException: Failed to load ApplicationContext
Caused by: java.lang.IllegalArgumentException: Cannot load an ApplicationContext with a NULL 'contextLoader'. Consider annotating your test class with @ContextConfiguration or @ContextHierarchy.
java.lang.IllegalStateException: Failed to load ApplicationContext
Caused by: java.lang.IllegalArgumentException: Cannot load an ApplicationContext with a NULL 'contextLoader'. Consider annotating your test class with @ContextConfiguration or @ContextHierarchy.
java.lang.IllegalStateException: Failed to load ApplicationContext
Caused by: java.lang.IllegalArgumentException: Cannot load an ApplicationContext with a NULL 'contextLoader'. Consider annotating your test class with @ContextConfiguration or @ContextHierarchy.
java.lang.IllegalStateException: Failed to load ApplicationContext
Caused by: java.lang.IllegalArgumentException: Cannot load an ApplicationContext with a NULL 'contextLoader'. Consider annotating your test class with @ContextConfiguration or @ContextHierarchy.
Fixed tests 2
Status Test Failing since View job Duration
Successful OpsBoardAdminPageIT canCreateAndUseDeepLink History
Failing since build #108 (Changes by Bamboo Administrator) Smoke Test (Flapping) 29 secs
Successful XRequestedWithRestIT verifyWWWAuthenticate History
Failing since build #108 (Changes by Bamboo Administrator) Smoke Test (Flapping) 15 secs

Jira issues

IssueDescriptionStatus
2 more issues…
Unknown Issue TypeHZN-1485Could not obtain issue details from Jira
Unknown Issue TypeNMS-10539Could not obtain issue details from Jira
Unknown Issue TypeNMS-10589Could not obtain issue details from Jira
Unknown Issue TypeNMS-15039Could not obtain issue details from Jira
Unknown Issue TypeNMS-105439Could not obtain issue details from Jira