Build #158

Build: #158 failed Changes by Bamboo Administrator and Benjamin Reed

Test results

  • 2,903 tests in total
  • 24 tests failed
  • 2 tests were fixed
  • 84 tests were quarantined / skipped
  • 193 minutes taken in total.
Existing test failures 24
Status Test Failing since View job Duration
java.lang.IllegalStateException: Failed to load ApplicationContext
	at org.springframework.test.context.cache.DefaultCacheAwareContextLoaderDelegate.loadContext(DefaultCacheAwareContextLoaderDelegate.java:124)
	at org.springframework.test.context.support.DefaultTestContext.getApplicationContext(DefaultTestContext.java:83)
	at org.springframework.test.context.support.DependencyInjectionTestExecutionListener.injectDependencies(DependencyInjectionTestExecutionListener.java:117)
	at org.springframework.test.context.support.DependencyInjectionTestExecutionListener.prepareTestInstance(DependencyInjectionTestExecutionListener.java:83)
	at org.springframework.test.context.TestContextManager.prepareTestInstance(TestContextManager.java:228)
	at org.springframework.test.context.junit4.SpringJUnit4ClassRunner.createTest(SpringJUnit4ClassRunner.java:230)
	at org.springframework.test.context.junit4.SpringJUnit4ClassRunner$1.runReflectiveCall(SpringJUnit4ClassRunner.java:289)
(171 more lines...)
java.lang.IllegalStateException: Failed to load ApplicationContext
	at org.springframework.test.context.cache.DefaultCacheAwareContextLoaderDelegate.loadContext(DefaultCacheAwareContextLoaderDelegate.java:124)
	at org.springframework.test.context.support.DefaultTestContext.getApplicationContext(DefaultTestContext.java:83)
	at org.springframework.test.context.support.DependencyInjectionTestExecutionListener.injectDependencies(DependencyInjectionTestExecutionListener.java:117)
	at org.springframework.test.context.support.DependencyInjectionTestExecutionListener.prepareTestInstance(DependencyInjectionTestExecutionListener.java:83)
	at org.springframework.test.context.TestContextManager.prepareTestInstance(TestContextManager.java:228)
	at org.springframework.test.context.junit4.SpringJUnit4ClassRunner.createTest(SpringJUnit4ClassRunner.java:230)
	at org.springframework.test.context.junit4.SpringJUnit4ClassRunner$1.runReflectiveCall(SpringJUnit4ClassRunner.java:289)
(171 more lines...)
java.lang.Exception: ActiveMQ broker was not started or stopped unexpectedly. Error: org.apache.activemq.broker.BrokerStoppedException: Stop invoked
	at org.opennms.core.test.activemq.ActiveMQBroker.before(ActiveMQBroker.java:56)
	at org.junit.rules.ExternalResource$1.evaluate(ExternalResource.java:46)
	at org.junit.rules.RunRules.evaluate(RunRules.java:20)
	at org.junit.runners.ParentRunner.run(ParentRunner.java:363)
	at org.springframework.test.context.junit4.SpringJUnit4ClassRunner.run(SpringJUnit4ClassRunner.java:193)
	at org.apache.maven.surefire.junit4.JUnit4Provider.execute(JUnit4Provider.java:275)
	at org.apache.maven.surefire.junit4.JUnit4Provider.executeWithRerun(JUnit4Provider.java:183)
(5 more lines...)
java.lang.IllegalStateException: Failed to load ApplicationContext
	at org.springframework.test.context.cache.DefaultCacheAwareContextLoaderDelegate.loadContext(DefaultCacheAwareContextLoaderDelegate.java:124)
	at org.springframework.test.context.support.DefaultTestContext.getApplicationContext(DefaultTestContext.java:83)
	at org.springframework.test.context.support.DependencyInjectionTestExecutionListener.injectDependencies(DependencyInjectionTestExecutionListener.java:117)
	at org.springframework.test.context.support.DependencyInjectionTestExecutionListener.prepareTestInstance(DependencyInjectionTestExecutionListener.java:83)
	at org.springframework.test.context.TestContextManager.prepareTestInstance(TestContextManager.java:228)
	at org.springframework.test.context.junit4.SpringJUnit4ClassRunner.createTest(SpringJUnit4ClassRunner.java:230)
	at org.springframework.test.context.junit4.SpringJUnit4ClassRunner$1.runReflectiveCall(SpringJUnit4ClassRunner.java:289)
(171 more lines...)
java.lang.IllegalStateException: Failed to load ApplicationContext
Caused by: java.lang.IllegalArgumentException: Cannot load an ApplicationContext with a NULL 'contextLoader'. Consider annotating your test class with @ContextConfiguration or @ContextHierarchy.
java.lang.IllegalStateException: Failed to load ApplicationContext
Caused by: java.lang.IllegalArgumentException: Cannot load an ApplicationContext with a NULL 'contextLoader'. Consider annotating your test class with @ContextConfiguration or @ContextHierarchy.
java.lang.IllegalStateException: Failed to load ApplicationContext
Caused by: java.lang.IllegalArgumentException: Cannot load an ApplicationContext with a NULL 'contextLoader'. Consider annotating your test class with @ContextConfiguration or @ContextHierarchy.
java.lang.IllegalStateException: Failed to load ApplicationContext
Caused by: java.lang.IllegalArgumentException: Cannot load an ApplicationContext with a NULL 'contextLoader'. Consider annotating your test class with @ContextConfiguration or @ContextHierarchy.
java.lang.IllegalStateException: Failed to load ApplicationContext
Caused by: java.lang.IllegalArgumentException: Cannot load an ApplicationContext with a NULL 'contextLoader'. Consider annotating your test class with @ContextConfiguration or @ContextHierarchy.
java.lang.IllegalStateException: Failed to load ApplicationContext
Caused by: java.lang.IllegalArgumentException: Cannot load an ApplicationContext with a NULL 'contextLoader'. Consider annotating your test class with @ContextConfiguration or @ContextHierarchy.
java.lang.IllegalStateException: Failed to load ApplicationContext
Caused by: java.lang.IllegalArgumentException: Cannot load an ApplicationContext with a NULL 'contextLoader'. Consider annotating your test class with @ContextConfiguration or @ContextHierarchy.
java.lang.IllegalStateException: Failed to load ApplicationContext
Caused by: java.lang.IllegalArgumentException: Cannot load an ApplicationContext with a NULL 'contextLoader'. Consider annotating your test class with @ContextConfiguration or @ContextHierarchy.
java.lang.IllegalStateException: Failed to load ApplicationContext
Caused by: java.lang.IllegalArgumentException: Cannot load an ApplicationContext with a NULL 'contextLoader'. Consider annotating your test class with @ContextConfiguration or @ContextHierarchy.
java.lang.IllegalStateException: Failed to load ApplicationContext
Caused by: java.lang.IllegalArgumentException: Cannot load an ApplicationContext with a NULL 'contextLoader'. Consider annotating your test class with @ContextConfiguration or @ContextHierarchy.
java.lang.IllegalStateException: Failed to load ApplicationContext
Caused by: java.lang.IllegalArgumentException: Cannot load an ApplicationContext with a NULL 'contextLoader'. Consider annotating your test class with @ContextConfiguration or @ContextHierarchy.
java.lang.IllegalStateException: Failed to load ApplicationContext
Caused by: java.lang.IllegalArgumentException: Cannot load an ApplicationContext with a NULL 'contextLoader'. Consider annotating your test class with @ContextConfiguration or @ContextHierarchy.
java.lang.IllegalStateException: Failed to load ApplicationContext
Caused by: java.lang.IllegalArgumentException: Cannot load an ApplicationContext with a NULL 'contextLoader'. Consider annotating your test class with @ContextConfiguration or @ContextHierarchy.
java.lang.IllegalStateException: Failed to load ApplicationContext
Caused by: java.lang.IllegalArgumentException: Cannot load an ApplicationContext with a NULL 'contextLoader'. Consider annotating your test class with @ContextConfiguration or @ContextHierarchy.
java.lang.IllegalStateException: Failed to load ApplicationContext
Caused by: java.lang.IllegalArgumentException: Cannot load an ApplicationContext with a NULL 'contextLoader'. Consider annotating your test class with @ContextConfiguration or @ContextHierarchy.
java.lang.IllegalStateException: Failed to load ApplicationContext
Caused by: java.lang.IllegalArgumentException: Cannot load an ApplicationContext with a NULL 'contextLoader'. Consider annotating your test class with @ContextConfiguration or @ContextHierarchy.
java.lang.IllegalStateException: Failed to load ApplicationContext
Caused by: java.lang.IllegalArgumentException: Cannot load an ApplicationContext with a NULL 'contextLoader'. Consider annotating your test class with @ContextConfiguration or @ContextHierarchy.
java.lang.IllegalStateException: Failed to load ApplicationContext
Caused by: java.lang.IllegalArgumentException: Cannot load an ApplicationContext with a NULL 'contextLoader'. Consider annotating your test class with @ContextConfiguration or @ContextHierarchy.
java.lang.IllegalStateException: Failed to load ApplicationContext
Caused by: java.lang.IllegalArgumentException: Cannot load an ApplicationContext with a NULL 'contextLoader'. Consider annotating your test class with @ContextConfiguration or @ContextHierarchy.
java.lang.IllegalStateException: Failed to load ApplicationContext
Caused by: java.lang.IllegalArgumentException: Cannot load an ApplicationContext with a NULL 'contextLoader'. Consider annotating your test class with @ContextConfiguration or @ContextHierarchy.
Fixed tests 2
Status Test Failing since View job Duration
Successful RpcOverKafkaIT verifyKafkaRpcWithIcmpServiceDetection History
Failing since build #157 (Changes by Bamboo Administrator) Smoke Test (Flapping) 15 secs
Successful RpcOverKafkaIT verifyKafkaRpcWithJdbcServiceDetection History
Failing since build #157 (Changes by Bamboo Administrator) Smoke Test (Flapping) < 1 sec
Skipped tests 84
Status Test Failing since View job
Skipped EchoRpcBlueprintIT org.opennms.core.rpc.aws.sqs.EchoRpcBlueprintIT History
Integration Test (Flapping)
Skipped EchoRpcIT org.opennms.core.rpc.aws.sqs.EchoRpcIT History
Integration Test (Flapping)
Skipped EchoRpcThreadIT org.opennms.core.rpc.aws.sqs.EchoRpcThreadIT History
Integration Test (Flapping)
Skipped InstallerDbIT testCatchIpInterfaceNullIpAddrColumnOnUpgrade History
Integration Test (Flapping)
Skipped InstallerDbIT testIpInterfaceForeignKeySnmpInterfaceIdOnUpgrade History
Integration Test (Flapping)
Skipped InstallerDbIT testSnmpInterfaceNodeIdColumnConvertToNotNull History
Integration Test (Flapping)
Skipped InstallerDbIT testOutagesForeignKeyIfServiceIdOnUpgrade History
Integration Test (Flapping)
Skipped InstallerDbIT testUpgradeRevision3952ToCurrentWithData History
Integration Test (Flapping)
Skipped InstallerDbIT testIfServicesNodeIdColumnConvertToNotNull History
Integration Test (Flapping)
Skipped InstallerDbIT testOutagesIfServiceIdColumnConvertToNotNull History
Integration Test (Flapping)
Skipped InstallerDbIT testUpgradeColumnToNotNullWithDefault History
Integration Test (Flapping)
Skipped InstallerDbIT testIfServicesIpAddrColumnConvertToNotNull History
Integration Test (Flapping)
Skipped InstallerDbIT testIfServicesForeignKeyIpInterfaceIdOnUpgrade History
Integration Test (Flapping)
Skipped InstallerDbIT testCatchSnmpInterfaceNullNodeIdColumnOnUpgrade History
Integration Test (Flapping)
Skipped InstallerDbIT testSetSnmpInterfaceIdOnUpgrade History
Integration Test (Flapping)
Skipped InstallerDbIT testSomethingUnknown History
Integration Test (Flapping)
Skipped InstallerDbIT testSnmpInterfaceSnmpIfIndexColumnConvertToNotNull History
Integration Test (Flapping)
Skipped InstallerDbIT testBug1574 History
Integration Test (Flapping)
Skipped InstallerDbIT testCatchIpInterfaceHasNullIpAddrValueOnUpgrade History
Integration Test (Flapping)
Skipped InstallerDbIT testIfServicesServiceIdColumnConvertToNotNull History
Integration Test (Flapping)
Skipped InstallerDbIT testOutagesServiceIdColumnConvertToNotNull History
Integration Test (Flapping)
Skipped InstallerDbIT testCatchSnmpInterfaceHasNullNodeIdValueOnUpgrade History
Integration Test (Flapping)
Skipped InstallerDbIT testSetOutageIdOnUpgrade History
Integration Test (Flapping)
Skipped InstallerDbIT testOutagesNodeIdColumnConvertToNotNull History
Integration Test (Flapping)
Skipped InstallerDbIT testSetUsersNotifiedIdOnUpgrade History
Integration Test (Flapping)
Skipped InstallerDbIT testSetEventSourceOnUpgrade History
Integration Test (Flapping)
Skipped InstallerDbIT testIpInterfaceNodeIdColumnConvertToNotNull History
Integration Test (Flapping)
Skipped InstallerDbIT testUpgradeRevision3952ToCurrent History
Integration Test (Flapping)
Skipped InstallerDbIT testAssetsIdOnUpgrade History
Integration Test (Flapping)
Skipped TemporaryDatabaseExecutionListenerNoClassAnnotationIT org.opennms.core.test.db.TemporaryDatabaseExecutionListenerNoClassAnnotationIT History
Integration Test (Flapping)
Skipped GenericURLStreamHandlerTest testFailToCreateURLStreamHandler History
Integration Test (Flapping)
Skipped NativeSocketTest org.opennms.jicmp.jna.NativeSocketTest History
Integration Test (Flapping)
Skipped PingThreadIT org.opennms.jicmp.standalone.PingThreadIT History
Integration Test (Flapping)
Skipped EventConfDataTest testV1EnterpriseIdAndGenericAndSpecificAndMatchWithVarbindsAndTC History
Integration Test (Flapping)
Skipped AlarmDaoIT testWithoutDistPoller History
Integration Test (Flapping)
Skipped AuthorizationIT testGetCategoriesWithAuthorizedGroups History
Integration Test (Flapping)
Skipped DefaultDataCollectionConfigDaoIT testLoadTimeOfDao History
Integration Test (Flapping)
Skipped JaxbUtilsTest testValidationMemoryLeak History
Integration Test (Flapping)
Skipped MonitoredServiceDaoIT testCriteriaBuilderWithApplicationAlias History
Integration Test (Flapping)
Skipped NodeDaoIT testCriteriaBuilderWithCategoryAlias History
Integration Test (Flapping)
Skipped JnaPingIT testPingCallbackTimeoutIPv4 History
Integration Test (Flapping)
Skipped JnaPingIT testParallelPingIPv4 History
Integration Test (Flapping)
Skipped JnaPingIT testPingCallbackTimeoutIPv6 History
Integration Test (Flapping)
Skipped JnaPingIT testParallelPingIPv6 History
Integration Test (Flapping)
Skipped JnaPingIT testParallelPingFailureIPv6 History
Integration Test (Flapping)
Skipped JnaPingIT testParallelPingFailureIPv4 History
Integration Test (Flapping)
Skipped JnaPingIT testSinglePingIPv4 History
Integration Test (Flapping)
Skipped JnaPingIT testSinglePingIPv6 History
Integration Test (Flapping)
Skipped JnaPingIT testSinglePingFailureIPv4 History
Integration Test (Flapping)
Skipped JnaPingIT testSinglePingFailureIPv6 History
Integration Test (Flapping)
Skipped Jni6PingIT testParallelPingFailureJni History
Integration Test (Flapping)
Skipped Jni6PingIT testSinglePingJni History
Integration Test (Flapping)
Skipped Jni6PingIT testSinglePingFailureJni History
Integration Test (Flapping)
Skipped Jni6PingIT testParallelPingJni History
Integration Test (Flapping)
Skipped Jni6PingIT testPingCallbackTimeoutJni History
Integration Test (Flapping)
Skipped JniPingIT testParallelPingJni History
Integration Test (Flapping)
Skipped JniPingIT testSinglePingFailureJni History
Integration Test (Flapping)
Skipped JniPingIT testParallelPingFailureJni History
Integration Test (Flapping)
Skipped JniPingIT testSinglePingJni History
Integration Test (Flapping)
Skipped JniPingIT testPingCallbackTimeoutJni History
Integration Test (Flapping)
Skipped AsyncDetectorFileDescriptorLeakTest org.opennms.netmgt.provision.detector.AsyncDetectorFileDescriptorLeakTest History
Integration Test (Flapping)
Skipped DominoIIOPDetectorTest testDetectorSuccessTokenPort History
Integration Test (Flapping)
Skipped IcmpDetectorIT testDetectorSuccessJni History
Integration Test (Flapping)
Skipped IcmpDetectorIT testDetectorFail History
Integration Test (Flapping)
Skipped IcmpDetectorIT testDetectorSuccessJniDscp History
Integration Test (Flapping)
Skipped IcmpDetectorIT testDetectorSuccess History
Integration Test (Flapping)
Skipped IcmpDetectorIT testDetectorSuccessDscp History
Integration Test (Flapping)
Skipped IcmpDetectorIT testDetectorFailJni History
Integration Test (Flapping)
Skipped LdapDetectorTest org.opennms.netmgt.provision.detector.LdapDetectorTest History
Integration Test (Flapping)
Skipped NrpeDetectorTest org.opennms.netmgt.provision.detector.NrpeDetectorTest History
Integration Test (Flapping)
Skipped TcpDetectorTest testSuccessNotExpectingBannerNoBannerSent History
Integration Test (Flapping)
Skipped HandlerTest dwOpenConnectionURL History
Integration Test (Flapping)
Skipped JRobinRrdStrategyTest testSampleSetFloatingPointValueWithComma History
Integration Test (Flapping)
Skipped JRobinRrdStrategyTest testSampleSetFloatingPointValueWithExtraJunk History
Integration Test (Flapping)
Skipped Snmp4JStrategyIT testSendWithNullConfig History
Integration Test (Flapping)
Skipped SnmpTrackerIT testAggregateTable History
Integration Test (Flapping)
Skipped SnmpUtilsIT testSendV2Trap[2] History
Integration Test (Flapping)
Skipped SnmpUtilsIT testSendV1Trap[2] History
Integration Test (Flapping)
Skipped SnmpUtilsIT testSendV2TestTrap[2] History
Integration Test (Flapping)
Skipped SnmpUtilsIT testSendV1TestTrap[2] History
Integration Test (Flapping)
Skipped IndexPageIT canSearchForNodeLabelInNodeId History
Smoke Test (Flapping)
Skipped JmxRemoteAdminIT org.opennms.smoketest.JmxRemoteAdminIT History
Smoke Test (Flapping)
Skipped MinionRestServiceIT verifyMinionRestEndPoint History
Smoke Test (Flapping)
Skipped ThresholdEditorIT org.opennms.smoketest.ThresholdEditorIT History
Smoke Test (Flapping)