Build #159

Build: #159 failed Changes by Benjamin Reed

Build result summary

Details

Completed
Duration
420 minutes
Labels
None
Revisions
OpenNMS (develop branch)
cdf0b4322767cb52c72ff7e1947783f1e805c419 cdf0b4322767cb52c72ff7e1947783f1e805c419
OpenNMS Installer
da12784d9ab4ba4aacedec0283d0c04075fd6ebf da12784d9ab4ba4aacedec0283d0c04075fd6ebf
OpenNMS-Repo
2e0438bd8d11ca989dba23b85c06c3f488a64bf2 2e0438bd8d11ca989dba23b85c06c3f488a64bf2
Smoke Tests
cb1e72265cf2ce10cb4872f58120272b340a1ce1 cb1e72265cf2ce10cb4872f58120272b340a1ce1
OpenNMS Bamboo Utils
0cc2b016b53a4c518d5d3276b6087e05db232bde 0cc2b016b53a4c518d5d3276b6087e05db232bde
OpenNMS System Test API
2f3a985377db43ce9b451390b9744bac402ffbd7 2f3a985377db43ce9b451390b9744bac402ffbd7
Total tests
2174
Failing since
#27 (Changes by mvrueden <mvrueden@users.noreply.github.com> and Jesse White)

Tests

Responsible

Code commits

OpenNMS (develop branch)
Author Commit Message Commit date
Benjamin Reed Benjamin Reed cdf0b4322767cb52c72ff7e1947783f1e805c419 cdf0b4322767cb52c72ff7e1947783f1e805c419 Merge remote-tracking branch 'origin/release-24.1.0' into develop
Chandra Gorantla <chandra@opennms.com> Chandra Gorantla <chandra@opennms.com> 9aa172b26fed46383c31e1078e5a12e42475c9f3 m 9aa172b26fed46383c31e1078e5a12e42475c9f3 HZN-1558: Add Tracing support for Sink API (#2495)
* HZN-1531: Move cache to google cache so that messages can be expired

* HZN-1558: Add tracing info to sink api

* HZN-1558: Add tracing support for Sink API

* HZN-1558: More flow related changes/fixes

* HZN-1558: Fix tests

* HZN-1558: Add docs for opentracing

* HZN-1558: more fixes to tracing support.

* HZN-1558: Move opennms-identity module to features/distributed
David Smith <smith@opennms.com> David Smith <smith@opennms.com> 6e9af42f50831c07610c70542aae68f5ab397042 m 6e9af42f50831c07610c70542aae68f5ab397042 NMS-9811: Favor fix in develop for DuplicatePrimaryAddressIT
Jesse White Jesse White cc61b109a2a9ae970cb71f6367674691c139877e m cc61b109a2a9ae970cb71f6367674691c139877e Merge pull request #2469 from OpenNMS/jira/NMS-10626
NMS-10626: Event parms using named capture groups in varbind matchers
Benjamin Reed Benjamin Reed a6b5c05185467f79e659194457e4878190b154f8 m a6b5c05185467f79e659194457e4878190b154f8 Merge pull request #2478 from OpenNMS/jira/NMS-10676
NMS-10676: fix shell exit codes for stop/start

Tests

New test failures 4
Status Test View job Duration
Collapse Failed HeartbeatSinkBlueprintIT canProduceAndConsumerMessages History
Integration Test (Flapping) 2 secs
java.lang.NullPointerException: null
	at org.opennms.core.ipc.sink.camel.itests.HeartbeatSinkBlueprintIT.canProduceAndConsumerMessages(HeartbeatSinkBlueprintIT.java:148)
Collapse Failed HeartbeatSinkBlueprintIT org.opennms.core.ipc.sink.camel.itests.HeartbeatSinkBlueprintIT History
Integration Test (Flapping) 8 secs
java.lang.Exception: ActiveMQ broker was not started or stopped unexpectedly. Error: org.apache.activemq.broker.BrokerStoppedException: Stop invoked
	at org.opennms.core.test.activemq.ActiveMQBroker.before(ActiveMQBroker.java:56)
	at org.junit.rules.ExternalResource$1.evaluate(ExternalResource.java:46)
	at org.junit.rules.RunRules.evaluate(RunRules.java:20)
	at org.junit.runners.ParentRunner.run(ParentRunner.java:363)
	at org.springframework.test.context.junit4.SpringJUnit4ClassRunner.run(SpringJUnit4ClassRunner.java:193)
	at org.apache.maven.surefire.junit4.JUnit4Provider.execute(JUnit4Provider.java:275)
	at org.apache.maven.surefire.junit4.JUnit4Provider.executeWithRerun(JUnit4Provider.java:183)
(5 more lines...)
Collapse Failed SinkBlueprintMessageFailureIT org.opennms.core.ipc.sink.camel.itests.SinkBlueprintMessageFailureIT History
Integration Test (Flapping) 3 secs
java.lang.Exception: ActiveMQ broker was not started or stopped unexpectedly. Error: org.apache.activemq.broker.BrokerStoppedException: Stop invoked
	at org.opennms.core.test.activemq.ActiveMQBroker.before(ActiveMQBroker.java:56)
	at org.junit.rules.ExternalResource$1.evaluate(ExternalResource.java:46)
	at org.junit.rules.RunRules.evaluate(RunRules.java:20)
	at org.junit.runners.ParentRunner.run(ParentRunner.java:363)
	at org.springframework.test.context.junit4.SpringJUnit4ClassRunner.run(SpringJUnit4ClassRunner.java:193)
	at org.apache.maven.surefire.junit4.JUnit4Provider.execute(JUnit4Provider.java:275)
	at org.apache.maven.surefire.junit4.JUnit4Provider.executeWithRerun(JUnit4Provider.java:183)
(5 more lines...)
Collapse Failed SinkBlueprintMessageFailureIT doesntLogMessageBody History
Integration Test (Flapping) 3 secs
java.lang.AssertionError: null
	at org.junit.Assert.fail(Assert.java:86)
	at org.junit.Assert.assertTrue(Assert.java:41)
	at org.junit.Assert.assertNotNull(Assert.java:712)
	at org.junit.Assert.assertNotNull(Assert.java:722)
	at org.opennms.core.ipc.sink.camel.itests.SinkBlueprintMessageFailureIT.doesntLogMessageBody(SinkBlueprintMessageFailureIT.java:141)

Jira issues

IssueDescriptionStatus
4 more issues…
Unknown Issue TypeHZN-1531Could not obtain issue details from Jira
Unknown Issue TypeHZN-1558Could not obtain issue details from Jira
Unknown Issue TypeHZN-1574Could not obtain issue details from Jira
Unknown Issue TypeNMS-9811Could not obtain issue details from Jira
Unknown Issue TypeNMS-10626Could not obtain issue details from Jira