Build #162

Test results

  • 2,395 tests in total
  • 22 tests failed
  • 1 test was fixed
  • 46 tests were quarantined / skipped
  • 186 minutes taken in total.
Existing test failures 22
Status Test Failing since View job Duration
java.lang.NullPointerException: null
	at org.opennms.core.ipc.sink.camel.itests.HeartbeatSinkPerfIT.setUp(HeartbeatSinkPerfIT.java:167)
java.lang.Exception: ActiveMQ broker was not started or stopped unexpectedly. Error: org.apache.activemq.broker.BrokerStoppedException: Stop invoked
	at org.opennms.core.test.activemq.ActiveMQBroker.before(ActiveMQBroker.java:56)
	at org.junit.rules.ExternalResource$1.evaluate(ExternalResource.java:46)
	at org.junit.rules.RunRules.evaluate(RunRules.java:20)
	at org.junit.runners.ParentRunner.run(ParentRunner.java:363)
	at org.springframework.test.context.junit4.SpringJUnit4ClassRunner.run(SpringJUnit4ClassRunner.java:193)
	at org.apache.maven.surefire.junit4.JUnit4Provider.execute(JUnit4Provider.java:275)
	at org.apache.maven.surefire.junit4.JUnit4Provider.executeWithRerun(JUnit4Provider.java:183)
(5 more lines...)
java.lang.IllegalStateException: Failed to load ApplicationContext
Caused by: java.lang.IllegalArgumentException: Cannot load an ApplicationContext with a NULL 'contextLoader'. Consider annotating your test class with @ContextConfiguration or @ContextHierarchy.
java.lang.IllegalStateException: Failed to load ApplicationContext
Caused by: java.lang.IllegalArgumentException: Cannot load an ApplicationContext with a NULL 'contextLoader'. Consider annotating your test class with @ContextConfiguration or @ContextHierarchy.
java.lang.IllegalStateException: Failed to load ApplicationContext
Caused by: java.lang.IllegalArgumentException: Cannot load an ApplicationContext with a NULL 'contextLoader'. Consider annotating your test class with @ContextConfiguration or @ContextHierarchy.
java.lang.IllegalStateException: Failed to load ApplicationContext
Caused by: java.lang.IllegalArgumentException: Cannot load an ApplicationContext with a NULL 'contextLoader'. Consider annotating your test class with @ContextConfiguration or @ContextHierarchy.
java.lang.IllegalStateException: Failed to load ApplicationContext
Caused by: java.lang.IllegalArgumentException: Cannot load an ApplicationContext with a NULL 'contextLoader'. Consider annotating your test class with @ContextConfiguration or @ContextHierarchy.
java.lang.IllegalStateException: Failed to load ApplicationContext
Caused by: java.lang.IllegalArgumentException: Cannot load an ApplicationContext with a NULL 'contextLoader'. Consider annotating your test class with @ContextConfiguration or @ContextHierarchy.
java.lang.IllegalStateException: Failed to load ApplicationContext
Caused by: java.lang.IllegalArgumentException: Cannot load an ApplicationContext with a NULL 'contextLoader'. Consider annotating your test class with @ContextConfiguration or @ContextHierarchy.
java.lang.IllegalStateException: Failed to load ApplicationContext
Caused by: java.lang.IllegalArgumentException: Cannot load an ApplicationContext with a NULL 'contextLoader'. Consider annotating your test class with @ContextConfiguration or @ContextHierarchy.
java.lang.IllegalStateException: Failed to load ApplicationContext
Caused by: java.lang.IllegalArgumentException: Cannot load an ApplicationContext with a NULL 'contextLoader'. Consider annotating your test class with @ContextConfiguration or @ContextHierarchy.
java.lang.IllegalStateException: Failed to load ApplicationContext
Caused by: java.lang.IllegalArgumentException: Cannot load an ApplicationContext with a NULL 'contextLoader'. Consider annotating your test class with @ContextConfiguration or @ContextHierarchy.
java.lang.IllegalStateException: Failed to load ApplicationContext
Caused by: java.lang.IllegalArgumentException: Cannot load an ApplicationContext with a NULL 'contextLoader'. Consider annotating your test class with @ContextConfiguration or @ContextHierarchy.
java.lang.IllegalStateException: Failed to load ApplicationContext
Caused by: java.lang.IllegalArgumentException: Cannot load an ApplicationContext with a NULL 'contextLoader'. Consider annotating your test class with @ContextConfiguration or @ContextHierarchy.
java.lang.IllegalStateException: Failed to load ApplicationContext
Caused by: java.lang.IllegalArgumentException: Cannot load an ApplicationContext with a NULL 'contextLoader'. Consider annotating your test class with @ContextConfiguration or @ContextHierarchy.
java.lang.IllegalStateException: Failed to load ApplicationContext
Caused by: java.lang.IllegalArgumentException: Cannot load an ApplicationContext with a NULL 'contextLoader'. Consider annotating your test class with @ContextConfiguration or @ContextHierarchy.
java.lang.IllegalStateException: Failed to load ApplicationContext
Caused by: java.lang.IllegalArgumentException: Cannot load an ApplicationContext with a NULL 'contextLoader'. Consider annotating your test class with @ContextConfiguration or @ContextHierarchy.
java.lang.IllegalStateException: Failed to load ApplicationContext
Caused by: java.lang.IllegalArgumentException: Cannot load an ApplicationContext with a NULL 'contextLoader'. Consider annotating your test class with @ContextConfiguration or @ContextHierarchy.
java.lang.IllegalStateException: Failed to load ApplicationContext
Caused by: java.lang.IllegalArgumentException: Cannot load an ApplicationContext with a NULL 'contextLoader'. Consider annotating your test class with @ContextConfiguration or @ContextHierarchy.
java.lang.IllegalStateException: Failed to load ApplicationContext
Caused by: java.lang.IllegalArgumentException: Cannot load an ApplicationContext with a NULL 'contextLoader'. Consider annotating your test class with @ContextConfiguration or @ContextHierarchy.
java.lang.IllegalStateException: Failed to load ApplicationContext
Caused by: java.lang.IllegalArgumentException: Cannot load an ApplicationContext with a NULL 'contextLoader'. Consider annotating your test class with @ContextConfiguration or @ContextHierarchy.
java.lang.IllegalStateException: Failed to load ApplicationContext
Caused by: java.lang.IllegalArgumentException: Cannot load an ApplicationContext with a NULL 'contextLoader'. Consider annotating your test class with @ContextConfiguration or @ContextHierarchy.
Fixed tests 1
Status Test Failing since View job Duration
Successful SinkBlueprintMessageFailureIT doesntLogMessageBody History
Failing since build #159 (Changes by Benjamin Reed) Integration Test (Flapping) 5 secs
Skipped tests 46
Status Test Failing since View job
Skipped EchoRpcBlueprintIT org.opennms.core.rpc.aws.sqs.EchoRpcBlueprintIT History
Integration Test (Flapping)
Skipped EchoRpcIT org.opennms.core.rpc.aws.sqs.EchoRpcIT History
Integration Test (Flapping)
Skipped EchoRpcThreadIT org.opennms.core.rpc.aws.sqs.EchoRpcThreadIT History
Integration Test (Flapping)
Skipped InstallerDbIT testSnmpInterfaceNodeIdColumnConvertToNotNull History
Integration Test (Flapping)
Skipped InstallerDbIT testSnmpInterfaceSnmpIfIndexColumnConvertToNotNull History
Integration Test (Flapping)
Skipped InstallerDbIT testUpgradeRevision3952ToCurrentWithData History
Integration Test (Flapping)
Skipped InstallerDbIT testBug1574 History
Integration Test (Flapping)
Skipped InstallerDbIT testIfServicesNodeIdColumnConvertToNotNull History
Integration Test (Flapping)
Skipped InstallerDbIT testCatchIpInterfaceHasNullIpAddrValueOnUpgrade History
Integration Test (Flapping)
Skipped InstallerDbIT testIfServicesServiceIdColumnConvertToNotNull History
Integration Test (Flapping)
Skipped InstallerDbIT testOutagesServiceIdColumnConvertToNotNull History
Integration Test (Flapping)
Skipped InstallerDbIT testOutagesIfServiceIdColumnConvertToNotNull History
Integration Test (Flapping)
Skipped InstallerDbIT testCatchSnmpInterfaceHasNullNodeIdValueOnUpgrade History
Integration Test (Flapping)
Skipped InstallerDbIT testSetOutageIdOnUpgrade History
Integration Test (Flapping)
Skipped InstallerDbIT testUpgradeColumnToNotNullWithDefault History
Integration Test (Flapping)
Skipped InstallerDbIT testIfServicesIpAddrColumnConvertToNotNull History
Integration Test (Flapping)
Skipped InstallerDbIT testIfServicesForeignKeyIpInterfaceIdOnUpgrade History
Integration Test (Flapping)
Skipped InstallerDbIT testCatchSnmpInterfaceNullNodeIdColumnOnUpgrade History
Integration Test (Flapping)
Skipped InstallerDbIT testSetSnmpInterfaceIdOnUpgrade History
Integration Test (Flapping)
Skipped InstallerDbIT testOutagesNodeIdColumnConvertToNotNull History
Integration Test (Flapping)
Skipped InstallerDbIT testSetUsersNotifiedIdOnUpgrade History
Integration Test (Flapping)
Skipped InstallerDbIT testSetEventSourceOnUpgrade History
Integration Test (Flapping)
Skipped InstallerDbIT testSomethingUnknown History
Integration Test (Flapping)
Skipped InstallerDbIT testIpInterfaceNodeIdColumnConvertToNotNull History
Integration Test (Flapping)
Skipped InstallerDbIT testUpgradeRevision3952ToCurrent History
Integration Test (Flapping)
Skipped InstallerDbIT testIpInterfaceForeignKeySnmpInterfaceIdOnUpgrade History
Integration Test (Flapping)
Skipped InstallerDbIT testAssetsIdOnUpgrade History
Integration Test (Flapping)
Skipped InstallerDbIT testOutagesForeignKeyIfServiceIdOnUpgrade History
Integration Test (Flapping)
Skipped InstallerDbIT testCatchIpInterfaceNullIpAddrColumnOnUpgrade History
Integration Test (Flapping)
Skipped TemporaryDatabaseExecutionListenerNoClassAnnotationIT org.opennms.core.test.db.TemporaryDatabaseExecutionListenerNoClassAnnotationIT History
Integration Test (Flapping)
Skipped GenericURLStreamHandlerTest testFailToCreateURLStreamHandler History
Integration Test (Flapping)
Skipped NativeSocketTest org.opennms.jicmp.jna.NativeSocketTest History
Integration Test (Flapping)
Skipped PingThreadIT org.opennms.jicmp.standalone.PingThreadIT History
Integration Test (Flapping)
Skipped EventConfDataTest testV1EnterpriseIdAndGenericAndSpecificAndMatchWithVarbindsAndTC History
Integration Test (Flapping)
Skipped AlarmDaoIT testWithoutDistPoller History
Integration Test (Flapping)
Skipped AuthorizationIT testGetCategoriesWithAuthorizedGroups History
Integration Test (Flapping)
Skipped DefaultDataCollectionConfigDaoIT testLoadTimeOfDao History
Integration Test (Flapping)
Skipped JaxbUtilsTest testValidationMemoryLeak History
Integration Test (Flapping)
Skipped MonitoredServiceDaoIT testCriteriaBuilderWithApplicationAlias History
Integration Test (Flapping)
Skipped NodeDaoIT testCriteriaBuilderWithCategoryAlias History
Integration Test (Flapping)
Skipped JRobinRrdStrategyTest testSampleSetFloatingPointValueWithExtraJunk History
Integration Test (Flapping)
Skipped JRobinRrdStrategyTest testSampleSetFloatingPointValueWithComma History
Integration Test (Flapping)
Skipped IndexPageIT canSearchForNodeLabelInNodeId History
Smoke Test (Flapping)
Skipped JmxRemoteAdminIT org.opennms.smoketest.JmxRemoteAdminIT History
Smoke Test (Flapping)
Skipped MinionRestServiceIT verifyMinionRestEndPoint History
Smoke Test (Flapping)
Skipped ThresholdEditorIT org.opennms.smoketest.ThresholdEditorIT History
Smoke Test (Flapping)