Build #64

Build result summary

Details

Completed
Duration
683 minutes
Labels
None
Revisions
OpenNMS (develop branch)
2efdb8cb6c08c9f83ca855c61264cf8ed56ae0b7 2efdb8cb6c08c9f83ca855c61264cf8ed56ae0b7
OpenNMS Installer
da12784d9ab4ba4aacedec0283d0c04075fd6ebf da12784d9ab4ba4aacedec0283d0c04075fd6ebf
OpenNMS-Repo
2e0438bd8d11ca989dba23b85c06c3f488a64bf2 2e0438bd8d11ca989dba23b85c06c3f488a64bf2
Smoke Tests
cb1e72265cf2ce10cb4872f58120272b340a1ce1 cb1e72265cf2ce10cb4872f58120272b340a1ce1
OpenNMS Bamboo Utils
420365a96ddd293e80ae215d72b18893a56189e0 420365a96ddd293e80ae215d72b18893a56189e0
OpenNMS System Test API
2f3a985377db43ce9b451390b9744bac402ffbd7 2f3a985377db43ce9b451390b9744bac402ffbd7
Total tests
4935
Failing since
#24 (Changes by Jesse White)

Responsible

Code commits

OpenNMS (develop branch)
Author Commit Message Commit date
Chandra Gorantla <chandra@opennms.com> Chandra Gorantla <chandra@opennms.com> 2efdb8cb6c08c9f83ca855c61264cf8ed56ae0b7 2efdb8cb6c08c9f83ca855c61264cf8ed56ae0b7 NMS-10678: Fix reload when drools engine encounters exception (#2505)
* NMS-10678: Refactor reloadConfig to make it optional to load state.

Fix the case where there is possibility of sending facts(events) while
the state being marshalled.

* NMS-10678: Reload state from memory in reloadDaemon case.

Add an event param to decide between persistState for users, by default it would persist.
address other review comments.
Benjamin Reed Benjamin Reed c60f93804ec3e538d06a2ac2c9738511ae93ccb5 c60f93804ec3e538d06a2ac2c9738511ae93ccb5 Merge pull request #2510 from OpenNMS/jira/NMS-10701
NMS-10701: make sure all Jetty code is using 9.4.18
Benjamin Reed Benjamin Reed 463d903315bcdfdf4e2f927e6ba48b4e73e8f1b4 m 463d903315bcdfdf4e2f927e6ba48b4e73e8f1b4 NMS-10701: make sure all Jetty code is using 9.4.18
OpenNMS Bamboo Utils
Author Commit Message Commit date
Benjamin Reed Benjamin Reed 420365a96ddd293e80ae215d72b18893a56189e0 420365a96ddd293e80ae215d72b18893a56189e0 check auth token before setting trap
Benjamin Reed Benjamin Reed d3710cc4d74bd49663db3585f8d225c8f68c5ace d3710cc4d74bd49663db3585f8d225c8f68c5ace update github status

Tests

New test failures 1
Status Test View job Duration
Collapse Failed OpsBoardAdminPageIT canCreateAndPreview History
Smoke Test (Flapping) 2 mins
org.openqa.selenium.StaleElementReferenceException: Element not found in the cache - perhaps the page has changed since it was looked up
Command duration or timeout: 120.10 seconds
For documentation on this error, please visit: http://seleniumhq.org/exceptions/stale_element_reference.html
Build info: version: '2.53.1', revision: 'a36b8b1cd5757287168e54b817830adce9b0158d', time: '2016-06-30 19:26:09'
System info: host: 'bambooagent05.internal.opennms.com', ip: '172.20.1.209', os.name: 'Linux', os.arch: 'amd64', os.version: '4.15.0-50-generic', java.version: '1.8.0_212'
Driver info: org.openqa.selenium.firefox.FirefoxDriver
Capabilities [{applicationCacheEnabled=true, rotatable=false, handlesAlerts=true, databaseEnabled=true, version=45.0.2, platform=LINUX, nativeEvents=false, acceptSslCerts=true, webStorageEnabled=true, locationContextEnabled=true, browserName=firefox, takesScreenshot=true, javascriptEnabled=true, cssSelectorsEnabled=true}]
Session ID: 3ddd26ea-2cc2-45cd-94e5-004186770af1
(16 more lines...)
Existing test failures 21
Status Test Failing since View job Duration
java.lang.IllegalStateException: Failed to load ApplicationContext
	at org.springframework.test.context.cache.DefaultCacheAwareContextLoaderDelegate.loadContext(DefaultCacheAwareContextLoaderDelegate.java:124)
	at org.springframework.test.context.support.DefaultTestContext.getApplicationContext(DefaultTestContext.java:83)
	at org.springframework.test.context.support.DependencyInjectionTestExecutionListener.injectDependencies(DependencyInjectionTestExecutionListener.java:117)
	at org.springframework.test.context.support.DependencyInjectionTestExecutionListener.prepareTestInstance(DependencyInjectionTestExecutionListener.java:83)
	at org.springframework.test.context.TestContextManager.prepareTestInstance(TestContextManager.java:228)
	at org.springframework.test.context.junit4.SpringJUnit4ClassRunner.createTest(SpringJUnit4ClassRunner.java:230)
	at org.springframework.test.context.junit4.SpringJUnit4ClassRunner$1.runReflectiveCall(SpringJUnit4ClassRunner.java:289)
(52 more lines...)
java.lang.IllegalStateException: Failed to load ApplicationContext
Caused by: java.lang.IllegalArgumentException: Cannot load an ApplicationContext with a NULL 'contextLoader'. Consider annotating your test class with @ContextConfiguration or @ContextHierarchy.
java.lang.IllegalStateException: Failed to load ApplicationContext
Caused by: java.lang.IllegalArgumentException: Cannot load an ApplicationContext with a NULL 'contextLoader'. Consider annotating your test class with @ContextConfiguration or @ContextHierarchy.
java.lang.IllegalStateException: Failed to load ApplicationContext
Caused by: java.lang.IllegalArgumentException: Cannot load an ApplicationContext with a NULL 'contextLoader'. Consider annotating your test class with @ContextConfiguration or @ContextHierarchy.
java.lang.IllegalStateException: Failed to load ApplicationContext
Caused by: java.lang.IllegalArgumentException: Cannot load an ApplicationContext with a NULL 'contextLoader'. Consider annotating your test class with @ContextConfiguration or @ContextHierarchy.
java.lang.IllegalStateException: Failed to load ApplicationContext
Caused by: java.lang.IllegalArgumentException: Cannot load an ApplicationContext with a NULL 'contextLoader'. Consider annotating your test class with @ContextConfiguration or @ContextHierarchy.
java.lang.IllegalStateException: Failed to load ApplicationContext
Caused by: java.lang.IllegalArgumentException: Cannot load an ApplicationContext with a NULL 'contextLoader'. Consider annotating your test class with @ContextConfiguration or @ContextHierarchy.
java.lang.IllegalStateException: Failed to load ApplicationContext
Caused by: java.lang.IllegalArgumentException: Cannot load an ApplicationContext with a NULL 'contextLoader'. Consider annotating your test class with @ContextConfiguration or @ContextHierarchy.
java.lang.IllegalStateException: Failed to load ApplicationContext
Caused by: java.lang.IllegalArgumentException: Cannot load an ApplicationContext with a NULL 'contextLoader'. Consider annotating your test class with @ContextConfiguration or @ContextHierarchy.
java.lang.IllegalStateException: Failed to load ApplicationContext
Caused by: java.lang.IllegalArgumentException: Cannot load an ApplicationContext with a NULL 'contextLoader'. Consider annotating your test class with @ContextConfiguration or @ContextHierarchy.
java.lang.IllegalStateException: Failed to load ApplicationContext
Caused by: java.lang.IllegalArgumentException: Cannot load an ApplicationContext with a NULL 'contextLoader'. Consider annotating your test class with @ContextConfiguration or @ContextHierarchy.
java.lang.IllegalStateException: Failed to load ApplicationContext
Caused by: java.lang.IllegalArgumentException: Cannot load an ApplicationContext with a NULL 'contextLoader'. Consider annotating your test class with @ContextConfiguration or @ContextHierarchy.
java.lang.IllegalStateException: Failed to load ApplicationContext
Caused by: java.lang.IllegalArgumentException: Cannot load an ApplicationContext with a NULL 'contextLoader'. Consider annotating your test class with @ContextConfiguration or @ContextHierarchy.
java.lang.IllegalStateException: Failed to load ApplicationContext
Caused by: java.lang.IllegalArgumentException: Cannot load an ApplicationContext with a NULL 'contextLoader'. Consider annotating your test class with @ContextConfiguration or @ContextHierarchy.
java.lang.IllegalStateException: Failed to load ApplicationContext
Caused by: java.lang.IllegalArgumentException: Cannot load an ApplicationContext with a NULL 'contextLoader'. Consider annotating your test class with @ContextConfiguration or @ContextHierarchy.
java.lang.IllegalStateException: Failed to load ApplicationContext
Caused by: java.lang.IllegalArgumentException: Cannot load an ApplicationContext with a NULL 'contextLoader'. Consider annotating your test class with @ContextConfiguration or @ContextHierarchy.
java.lang.IllegalStateException: Failed to load ApplicationContext
Caused by: java.lang.IllegalArgumentException: Cannot load an ApplicationContext with a NULL 'contextLoader'. Consider annotating your test class with @ContextConfiguration or @ContextHierarchy.
java.lang.IllegalStateException: Failed to load ApplicationContext
Caused by: java.lang.IllegalArgumentException: Cannot load an ApplicationContext with a NULL 'contextLoader'. Consider annotating your test class with @ContextConfiguration or @ContextHierarchy.
java.lang.IllegalStateException: Failed to load ApplicationContext
Caused by: java.lang.IllegalArgumentException: Cannot load an ApplicationContext with a NULL 'contextLoader'. Consider annotating your test class with @ContextConfiguration or @ContextHierarchy.
java.lang.IllegalStateException: Failed to load ApplicationContext
Caused by: java.lang.IllegalArgumentException: Cannot load an ApplicationContext with a NULL 'contextLoader'. Consider annotating your test class with @ContextConfiguration or @ContextHierarchy.
org.openqa.selenium.TimeoutException: Timed out after 120 seconds waiting for org.opennms.smoketest.OpenNMSSeleniumTestCase$3@52dc7ac4
Build info: version: '2.53.1', revision: 'a36b8b1cd5757287168e54b817830adce9b0158d', time: '2016-06-30 19:26:09'
System info: host: 'bambooagent05.internal.opennms.com', ip: '172.20.1.209', os.name: 'Linux', os.arch: 'amd64', os.version: '4.15.0-50-generic', java.version: '1.8.0_212'
Driver info: org.openqa.selenium.firefox.FirefoxDriver
Capabilities [{applicationCacheEnabled=true, rotatable=false, handlesAlerts=true, databaseEnabled=true, version=45.0.2, platform=LINUX, nativeEvents=false, acceptSslCerts=true, webStorageEnabled=true, locationContextEnabled=true, browserName=firefox, takesScreenshot=true, javascriptEnabled=true, cssSelectorsEnabled=true}]
Session ID: 831311bd-7f31-44c1-a3b0-e4ed152d0527
org.openqa.selenium.TimeoutException: 
Timed out after 120 seconds waiting for org.opennms.smoketest.OpenNMSSeleniumTestCase$3@52dc7ac4
(6 more lines...)

Jira issues

IssueDescriptionStatus
Unknown Issue TypeNMS-10678Could not obtain issue details from Jira
Unknown Issue TypeNMS-10701Could not obtain issue details from Jira

Shared artifacts

Artifact File size
RPMs 1 GB
Source Tarball 122 MB