Build #1,490

Build: #1490 failed Changes by Jesse White

Build result summary

Details

Completed
Duration
226 minutes
Labels
None
Revisions
OpenNMS (develop branch)
37c8a1d594fafb8d28c73bef8d1509548c2479e7 37c8a1d594fafb8d28c73bef8d1509548c2479e7
OpenNMS Installer
da12784d9ab4ba4aacedec0283d0c04075fd6ebf da12784d9ab4ba4aacedec0283d0c04075fd6ebf
OpenNMS-Repo
f5e5741a5d30d89199cb3b6d2e4966e8a659881e f5e5741a5d30d89199cb3b6d2e4966e8a659881e
Smoke Tests
cb1e72265cf2ce10cb4872f58120272b340a1ce1 cb1e72265cf2ce10cb4872f58120272b340a1ce1
OpenNMS Bamboo Utils
c5b0514a984dd599487469d47e6a69527d55515a c5b0514a984dd599487469d47e6a69527d55515a
OpenNMS System Test API
38d1a693589d2d93b67a70d090bc19df37de1e7f 38d1a693589d2d93b67a70d090bc19df37de1e7f
Total tests
2301

Responsible

Code commits

OpenNMS (develop branch)
Author Commit Message Commit date
Jesse White Jesse White 37c8a1d594fafb8d28c73bef8d1509548c2479e7 37c8a1d594fafb8d28c73bef8d1509548c2479e7 Merge branch 'jira/NMS-10331' into develop
Jesse White Jesse White 2595bd25342e81463cf14c74060047e4f5387586 m 2595bd25342e81463cf14c74060047e4f5387586 NMS-10331: Add callbacks to the AlarmEntityListener for archived alarms.

Tests

New test failures 2
Status Test View job Duration
Collapse Failed SinkBlueprintMessageFailureIT org.opennms.core.ipc.sink.camel.itests.SinkBlueprintMessageFailureIT History
Integration Test 3 secs
java.lang.Exception: ActiveMQ broker was not started or stopped unexpectedly. Error: org.apache.activemq.broker.BrokerStoppedException: Stop invoked
	at org.opennms.core.test.activemq.ActiveMQBroker.before(ActiveMQBroker.java:56)
	at org.junit.rules.ExternalResource$1.evaluate(ExternalResource.java:46)
	at org.junit.rules.RunRules.evaluate(RunRules.java:20)
	at org.junit.runners.ParentRunner.run(ParentRunner.java:363)
	at org.springframework.test.context.junit4.SpringJUnit4ClassRunner.run(SpringJUnit4ClassRunner.java:193)
	at org.apache.maven.surefire.junit4.JUnit4Provider.execute(JUnit4Provider.java:275)
	at org.apache.maven.surefire.junit4.JUnit4Provider.executeWithRerun(JUnit4Provider.java:183)
(5 more lines...)
Collapse Failed SinkBlueprintMessageFailureIT doesntLogMessageBody History
Integration Test 3 secs
java.lang.AssertionError: null
	at org.junit.Assert.fail(Assert.java:86)
	at org.junit.Assert.assertTrue(Assert.java:41)
	at org.junit.Assert.assertNotNull(Assert.java:712)
	at org.junit.Assert.assertNotNull(Assert.java:722)
	at org.opennms.core.ipc.sink.camel.itests.SinkBlueprintMessageFailureIT.doesntLogMessageBody(SinkBlueprintMessageFailureIT.java:140)

Jira issues

IssueDescriptionStatus
Unknown Issue TypeNMS-10331Could not obtain issue details from Jira