Build #120

Build: #120 failed Changes by Jesse White

Build result summary

Details

Completed
Duration
490 minutes
Labels
None
Revisions
OpenNMS (develop branch)
44acbe7a5a2bdd63a69088f593db3460c3b71a0e 44acbe7a5a2bdd63a69088f593db3460c3b71a0e
OpenNMS Installer
da12784d9ab4ba4aacedec0283d0c04075fd6ebf da12784d9ab4ba4aacedec0283d0c04075fd6ebf
OpenNMS-Repo
cacabc963c8e20c225ae81f81a69c8fe58ddc4c0 cacabc963c8e20c225ae81f81a69c8fe58ddc4c0
Smoke Tests
cb1e72265cf2ce10cb4872f58120272b340a1ce1 cb1e72265cf2ce10cb4872f58120272b340a1ce1
OpenNMS Bamboo Utils
8317f19cdbcc21a78e8e0af5eb8554ffc33e8591 8317f19cdbcc21a78e8e0af5eb8554ffc33e8591
OpenNMS System Test API
37d1c9d8432831a26f268e3b1199baa171787834 37d1c9d8432831a26f268e3b1199baa171787834
Total tests
8174
Failing since
#118 (Changes by Bamboo Administrator)

Tests

Responsible

Code commits

OpenNMS (develop branch)
Author Commit Message Commit date
Jesse White Jesse White 44acbe7a5a2bdd63a69088f593db3460c3b71a0e 44acbe7a5a2bdd63a69088f593db3460c3b71a0e parent branch is develop
Jesse White Jesse White b740866a06a23a4c445a324637b0cca0b718355c b740866a06a23a4c445a324637b0cca0b718355c bump version
Jesse White Jesse White 8f7f4a2a4c4ba0082c341a45cf74cea7edbdf1eb 8f7f4a2a4c4ba0082c341a45cf74cea7edbdf1eb Merge remote-tracking branch 'origin/release-25.0.0' into develop
Jesse White Jesse White f5ae6936f84dab5716d07ae0fb15fb023f84f8b3 m f5ae6936f84dab5716d07ae0fb15fb023f84f8b3 Merge remote-tracking branch 'origin/foundation-2018' into release-25.0.0
Jesse White Jesse White 45a0971be59d5c51295a13fad47d8fa1d61f687e m 45a0971be59d5c51295a13fad47d8fa1d61f687e Ignore flapping test.
org.openqa.selenium.StaleElementReferenceException:
The element reference of <select id="outageTypeSelector" name="outageType"> is stale; either the element is no longer attached to the DOM, it is not in the current frame context, or the document has been refreshed

Tests

New test failures 1
Status Test View job Duration
Collapse Failed ChooseResourcesPageIT verifyGraphAll History
Smoke Tests 4 mins
org.opennms.smoketest.selenium.OpenNMSTestException: org.opennms.smoketest.selenium.OpenNMSTestException: org.openqa.selenium.TimeoutException: Expected condition failed: waiting for org.opennms.smoketest.selenium.AbstractOpenNMSSeleniumHelper$WaitForNodesInDatabase@413bef78 (tried for 240 second(s) with 500 milliseconds interval)
Build info: version: '3.141.59', revision: 'e82be7d358', time: '2018-11-14T08:17:03'
System info: host: 'bambooagent04.internal.opennms.com', ip: '172.20.1.208', os.name: 'Linux', os.arch: 'amd64', os.version: '4.15.0-62-generic', java.version: '1.8.0_222'
Driver info: org.openqa.selenium.remote.RemoteWebDriver
Capabilities {acceptInsecureCerts: true, browserName: firefox, browserVersion: 69.0, javascriptEnabled: true, moz:accessibilityChecks: false, moz:buildID: 20190827005903, moz:geckodriverVersion: 0.24.0, moz:headless: false, moz:processID: 66, moz:profile: /tmp/rust_mozprofile.KZPSI4..., moz:shutdownTimeout: 60000, moz:useNonSpecCompliantPointerOrigin: false, moz:webdriverClick: true, pageLoadStrategy: normal, platform: LINUX, platformName: LINUX, platformVersion: 4.15.0-62-generic, rotatable: false, setWindowRect: true, strictFileInteractability: false, timeouts: {implicit: 0, pageLoad: 300000, script: 30000}, unhandledPromptBehavior: dismiss and notify, webdriver.remote.sessionid: 12306980-5d4d-44fd-9c7e-4cc...}
Session ID: 12306980-5d4d-44fd-9c7e-4ccc3be43b78
org.opennms.smoketest.selenium.OpenNMSTestException: 
org.opennms.smoketest.selenium.OpenNMSTestException: org.openqa.selenium.TimeoutException: Expected condition failed: waiting for org.opennms.smoketest.selenium.AbstractOpenNMSSeleniumHelper$WaitForNodesInDatabase@413bef78 (tried for 240 second(s) with 500 milliseconds interval)
(22 more lines...)

Jira issues

IssueDescriptionStatus
10 more issues…
Unknown Issue TypeLTS-234Could not obtain issue details from Jira
Unknown Issue TypeNMS-10703Could not obtain issue details from Jira
Unknown Issue TypeNMS-11721Could not obtain issue details from Jira
Unknown Issue TypeNMS-12226Could not obtain issue details from Jira
Unknown Issue TypeNMS-12233Could not obtain issue details from Jira

Shared artifacts

Artifact File size
Build Information 102 bytes
Target Files 4 GB
M2 Repository 4 GB
RPMs 1 GB
Source Tarball 133 MB
DEBs 1 GB
XSDs 62 KB
Installer Zip 1010 MB
Javadoc Tarball 17 MB