Build: #248 failed Changes by Jesse White

Build result summary

Details

Completed
Duration
641 minutes
Labels
None
Revisions
OpenNMS (develop branch)
878584cbb8ed03093ff92925318dabb499786fa7 878584cbb8ed03093ff92925318dabb499786fa7
OpenNMS Installer
da12784d9ab4ba4aacedec0283d0c04075fd6ebf da12784d9ab4ba4aacedec0283d0c04075fd6ebf
OpenNMS-Repo
932cd06b86876f5346aa9177005778811b85a865 932cd06b86876f5346aa9177005778811b85a865
Smoke Tests
cb1e72265cf2ce10cb4872f58120272b340a1ce1 cb1e72265cf2ce10cb4872f58120272b340a1ce1
OpenNMS Bamboo Utils
8317f19cdbcc21a78e8e0af5eb8554ffc33e8591 8317f19cdbcc21a78e8e0af5eb8554ffc33e8591
OpenNMS System Test API
443c507e74f4f2648afc4f819e7afa1276f71e3e 443c507e74f4f2648afc4f819e7afa1276f71e3e
Total tests
5293
Failing since
#247 (Changes by Ronny Trommer)

Tests

Responsible

Branch integration details

Checked out
develop d257443ee6b7de3c1af44905a48eb097e65bf0f3
Merged with
release-26.0.0 878584cbb8ed03093ff92925318dabb499786fa7 878584cbb8ed03093ff92925318dabb499786fa7

Code commits

OpenNMS (develop branch)
Author Commit Message Commit date
Jesse White Jesse White 878584cbb8ed03093ff92925318dabb499786fa7 878584cbb8ed03093ff92925318dabb499786fa7 Merge pull request #2947 from OpenNMS/jira/NMS-12631
NMS-12631: Disable JMS when using Kafka.
Jesse White Jesse White e8ca551db3a5b6252971767e02185505a788d2fa e8ca551db3a5b6252971767e02185505a788d2fa NMS-12631: Disable JMS when using Kafka.

Tests

New test failures 2
Status Test View job Duration
Collapse Failed HeartbeatSinkPerfIT quickRun History
Integration Tests 30 secs
org.junit.runners.model.TestTimedOutException: test timed out after 30000 milliseconds
	at java.lang.ClassLoader.defineClass1(Native Method)
	at java.lang.ClassLoader.defineClass(ClassLoader.java:763)
	at java.security.SecureClassLoader.defineClass(SecureClassLoader.java:142)
	at java.net.URLClassLoader.defineClass(URLClassLoader.java:468)
	at java.net.URLClassLoader.access$100(URLClassLoader.java:74)
	at java.net.URLClassLoader$1.run(URLClassLoader.java:369)
	at java.net.URLClassLoader$1.run(URLClassLoader.java:363)
(10 more lines...)
Collapse Failed ThresholdingIT canTriggerHighResponseTimeThreshold History
Smoke Tests < 1 sec
java.lang.AssertionError: 
Expected: <201>
     but: was <500>
java.lang.AssertionError: 

Expected: <201>
     but: was <500>
	at org.opennms.smoketest.ThresholdingIT.addNode(ThresholdingIT.java:220)
(1 more lines...)

Jira issues

IssueDescriptionStatus
Unknown Issue TypeNMS-12631Could not obtain issue details from Jira