Build #94

Build: #94 was successful

Job: Debian Snapshot was successful

Job result summary

Completed
Duration
16 minutes
Agent
mit.internal.opennms.com
Revision
c13787676560a06bca77ff0402e89a523d67cc83 c13787676560a06bca77ff0402e89a523d67cc83
Successful since
#70 ()

Error summary

The build generated some errors. See the full build log for more details.

dpkg-shlibdeps: error: cannot find library libc.so.6 needed by debian/opennms-common/usr/share/opennms/lib/linux32/librxtxParallel.so (ELF format: 'elf32-i386' abi: '0101000300000000'; RPATH: '')
dpkg-shlibdeps: warning: debian/opennms-common/usr/share/opennms/lib/linux64/librxtxSerial.so contains an unresolvable reference to symbol ceil: it's probably a plugin
dpkg-shlibdeps: error: cannot find library libpthread.so.0 needed by debian/opennms-common/usr/share/opennms/lib/linux32/librxtxSerial.so (ELF format: 'elf32-i386' abi: '0101000300000000'; RPATH: '')
dpkg-shlibdeps: error: cannot find library libc.so.6 needed by debian/opennms-common/usr/share/opennms/lib/linux32/librxtxSerial.so (ELF format: 'elf32-i386' abi: '0101000300000000'; RPATH: '')
dpkg-shlibdeps: error: cannot continue due to the errors listed above
Note: libraries are not searched in other binary packages that do not have any shlibs or symbols file.
To help dpkg-shlibdeps find private libraries, you might need to use -l.
dh_shlibdeps: dpkg-shlibdeps -Tdebian/opennms-common.substvars debian/opennms-common/usr/share/opennms/lib/linux64/librxtxSerial.so debian/opennms-common/usr/share/opennms/lib/linux32/librxtxSerial.so debian/opennms-common/usr/share/opennms/lib/linux32/librxtxParallel.so returned exit code 2
dh_shlibdeps: Aborting due to earlier error
make: [binary-indep] Error 2 (ignored)
dpkg-gencontrol: warning: package opennms-db: unused substitution variable ${misc:Depends}
dpkg-gencontrol: warning: package opennms-plugin-protocol-xml: unused substitution variable ${perl:Depends}
dpkg-genbuildinfo
dpkg-genchanges  >../opennms_17.0.1-0.20181215.pbo2016.master.94_amd64.changes
dpkg-genchanges: info: including full source code in upload
dpkg-source --after-build build
send: spawn id exp4 not open
    while executing
"send -- "\r""
send: spawn id exp4 not open
    while executing
"send -- "\r""
send: spawn id exp4 not open
    while executing
"send -- "\r""
send: spawn id exp4 not open
    while executing
"send -- "\r""
send: spawn id exp4 not open
    while executing
"send -- "\r""
send: spawn id exp4 not open
    while executing
"send -- "\r""
send: spawn id exp4 not open
    while executing
"send -- "\r""
send: spawn id exp4 not open
    while executing
"send -- "\r""
send: spawn id exp4 not open
    while executing
"send -- "\r""
send: spawn id exp4 not open
    while executing
"send -- "\r""
send: spawn id exp4 not open
    while executing
"send -- "\r""
send: spawn id exp4 not open
    while executing
"send -- "\r""
send: spawn id exp4 not open
    while executing
"send -- "\r""
send: spawn id exp4 not open
    while executing
"send -- "\r""
send: spawn id exp4 not open
    while executing
"send -- "\r""
send: spawn id exp4 not open
    while executing
"send -- "\r""
send: spawn id exp4 not open
    while executing
"send -- "\r""
send: spawn id exp4 not open
    while executing
"send -- "\r""
send: spawn id exp4 not open
    while executing
"send -- "\r""
send: spawn id exp4 not open
    while executing
"send -- "\r""
send: spawn id exp4 not open
    while executing
"send -- "\r""
send: spawn id exp4 not open
    while executing
"send -- "\r""
send: spawn id exp4 not open
    while executing
"send -- "\r""
send: spawn id exp4 not open
    while executing
"send -- "\r""
send: spawn id exp4 not open
    while executing
"send -- "\r""
send: spawn id exp4 not open
    while executing
"send -- "\r""
send: spawn id exp4 not open
    while executing
"send -- "\r""
send: spawn id exp4 not open
    while executing
"send -- "\r""